{"text_format":"1","workbook":"xlsx","n_sheets":3,"sheets":["Notes Balance","Cumulative Defaults","Collateral Tables"],"not_rendered":{"charts":1,"images":0,"macros":1,"external_links":7,"defined_names":24,"comments":1,"pivot_tables":0},"unopened":[],"bounds":{"document_bytes":16777216,"sheet_cells":100000,"rows_first":2000,"rows_last":500,"rows_between":2000,"halvings":0,"cell_chars":16384,"cell_head_chars":4096},"cells_cut":0,"cells_raw":0,"read":"whole","date_system":"1900"}

{"sheet":"Notes Balance","index":0,"n_rows":108,"n_cols":6,"rows_kept":108,"cut":false,"hidden":false,"merged":[]}
["TOTAL NOTE BALANCES"]
[null,"Total Notes","Class A1 Notes","Class A2 Notes","Class B Notes","Class C Notes"]
["Initial Invested Amount",{"$f":"SUM(C3:F3)","v":423450000},115000000,286850000,11250000,10350000]
["Invested Amount as at Previous Payment Date:  16 August 2018",{"$f":"SUM(C4:F4)","v":423450000},115000000,286850000,11250000,10350000]
["Stated Amount as at Previous Payment Date:  16 August 2018",423450000,115000000,286850000,11250000,10350000]
["Principal Payments to Noteholders on Payment Date",39614786.810000002,39614786.810000002,0,0,0]
["Gross Aggregate Charge-Offs",0,0,0,0,0]
["Gross Aggregate Reinstatements of charge-offs",0,0,0,0,0]
["Aggregate Charge-Offs for this Collection Period",0,0,0,0,0]
["Reinstatements relating to Charge-offs that have occurred this Collection Period",0,0,0,0,0]
["Aggregate Carry Over Charge-offs not previously reinstated",0,0,0,0,0]
["Reinstatements of Carry Over Charge-offs not previously reinstated",0,0,0,0,0]
["Aggregate Charge-Offs not reinstated and to be carried over to next period",0,0,0,0,0]
["Invested Amount as at Payment Date:  16 November 2018",383835213.19,75385213.189999998,286850000,11250000,10350000]
["Stated Amount as at Payment Date:  16 November 2018",383835213.19,75385213.189999998,286850000,11250000,10350000]
["Bond Factor at Payment Date:  16 November 2018",null,0.65552359295652174,1,1,1]
["Coupon Margin",null,7.3000000000000001E-3,1.0800000000000001E-2,1.7000000000000001E-2,2.2499999999999999E-2]
["Coupon Rate (3 month BBSW + margin)",null,2.6850000000000002E-2,3.0350000000000002E-2,3.6549999999999999E-2,4.2050000000000004E-2]
["Days in Coupon Period",null,92,92,92,92]
["Coupon Entitlement to be paid out on the current Payment Date: 16 November 2018",null,778282.19,2194363.21,103641.78,109698.66]
[]
[]
["TOTAL NOTE BALANCES"]
[null,"Total Notes","Class A1 Notes","Class A2 Notes","Class B Notes","Class C Notes"]
["Initial Invested Amount",{"$f":"SUM(C25:F25)","v":423450000},115000000,286850000,11250000,10350000]
["Invested Amount as at Previous Payment Date:  16 November 2018",{"$f":"SUM(C26:F26)","v":383835213.19},75385213.189999998,286850000,11250000,10350000]
["Stated Amount as at Previous Payment Date:  16 November 2018",383835213.19,75385213.189999998,286850000,11250000,10350000]
["Principal Payments to Noteholders on Payment Date",27133674.77,27133674.77,0,0,0]
["Gross Aggregate Charge-Offs",0,0,0,0,0]
["Gross Aggregate Reinstatements of charge-offs",0,0,0,0,0]
["Aggregate Charge-Offs for this Collection Period",0,0,0,0,0]
["Reinstatements relating to Charge-offs that have occurred this Collection Period",0,0,0,0,0]
["Aggregate Carry Over Charge-offs not previously reinstated",0,0,0,0,0]
["Reinstatements of Carry Over Charge-offs not previously reinstated",0,0,0,0,0]
["Aggregate Charge-Offs not reinstated and to be carried over to next period",0,0,0,0,0]
["Invested Amount as at Payment Date:  18 February 2019",356701538.42000002,48251538.420000002,286850000,11250000,10350000]
["Stated Amount as at Payment Date:  18 February 2019",356701538.42000002,48251538.420000002,286850000,11250000,10350000]
["Bond Factor at Payment Date:  18 February 2019",null,0.41957859495652178,1,1,1]
["Coupon Margin",null,7.3000000000000001E-3,1.0800000000000001E-2,1.7000000000000001E-2,2.2499999999999999E-2]
["Coupon Rate (3 month BBSW + margin)",null,2.6710000000000001E-2,3.0210000000000001E-2,3.6409999999999998E-2,4.1910000000000003E-2]
["Days in Coupon Period",null,94,94,94,94]
["Coupon Entitlement to be paid out on the current Payment Date: 18 February 2019",null,518555.26,2231724.44,105489.25,111710.24]
[]
[]
["TOTAL NOTE BALANCES"]
[null,"Total Notes","Class A1 Notes","Class A2 Notes","Class B Notes","Class C Notes"]
["Initial Invested Amount",{"$f":"SUM(C47:F47)","v":423450000},115000000,286850000,11250000,10350000]
["Invested Amount as at Previous Payment Date:  18 February 2019",{"$f":"SUM(C48:F48)","v":356701538.42000002},48251538.420000002,286850000,11250000,10350000]
["Stated Amount as at Previous Payment Date:  18 February 2019",{"$f":"SUM(C49:F49)","v":356701538.42000002},48251538.420000002,286850000,11250000,10350000]
["Principal Payments to Noteholders on Payment Date",{"$f":"SUM(C50:F50)","v":60199851.230000004},48251538.420000002,11948312.810000001,0,0]
["Gross Aggregate Charge-Offs",{"$f":"SUM(B51:F51)","v":0},0,0,0,0]
["Gross Aggregate Reinstatements of charge-offs",{"$f":"SUM(C52:F52)","v":0},0,0,0,0]
["Aggregate Charge-Offs for this Collection Period",{"$f":"SUM(C53:F53)","v":0},0,0,0,0]
["Reinstatements relating to Charge-offs that have occurred this Collection Period",{"$f":"SUM(C54:F54)","v":0},0,0,0,0]
["Aggregate Carry Over Charge-offs not previously reinstated",0,0,0,0,0]
["Reinstatements of Carry Over Charge-offs not previously reinstated",0,0,0,0,0]
["Aggregate Charge-Offs not reinstated and to be carried over to next period",{"$f":"SUM(C57:F57)","v":0},0,0,0,0]
["Invested Amount as at Payment Date:  16 May 2019",{"$f":"SUM(C58:F58)","v":296501687.19},0,274901687.19,11250000,10350000]
["Stated Amount as at Payment Date:  16 May 2019",{"$f":"SUM(C59:F59)","v":296501687.19},0,274901687.19,11250000,10350000]
["Bond Factor at Payment Date:  16 May 2019",null,0,0.95834647791528671,1,1]
["Coupon Margin",null,7.3000000000000001E-3,1.0800000000000001E-2,1.7000000000000001E-2,2.2499999999999999E-2]
["Coupon Rate (3 month BBSW + margin)",null,2.6800000000000001E-2,3.0300000000000001E-2,3.6500000000000005E-2,4.1999999999999996E-2]
["Days in Coupon Period",null,87,87,87,87]
["Coupon Entitlement to be paid out on the current Payment Date: 16 May 2019",null,308228.18,2071685.71,97875,103613.42]
[]
[]
["TOTAL NOTE BALANCES"]
[null,"Total Notes","Class A1 Notes","Class A2 Notes","Class B Notes","Class C Notes"]
["Initial Invested Amount",{"$f":"SUM(C69:F69)","v":423450000},115000000,286850000,11250000,10350000]
["Invested Amount as at Previous Payment Date:  16 May 2019",{"$f":"SUM(C70:F70)","v":296501687.19},0,274901687.19,11250000,10350000]
["Stated Amount as at Previous Payment Date:  16 May 2019",296501687.19,0,274901687.19,11250000,10350000]
["Principal Payments to Noteholders on Payment Date",19267098.829999998,0,19267098.829999998,0,0]
["Gross Aggregate Charge-Offs",0,0,0,0,0]
["Gross Aggregate Reinstatements of charge-offs",0,0,0,0,0]
["Aggregate Charge-Offs for this Collection Period",0,0,0,0,0]
["Reinstatements relating to Charge-offs that have occurred this Collection Period",0,0,0,0,0]
["Aggregate Carry Over Charge-offs not previously reinstated",0,0,0,0,0]
["Reinstatements of Carry Over Charge-offs not previously reinstated",0,0,0,0,0]
["Aggregate Charge-Offs not reinstated and to be carried over to next period",{"$f":"SUM(C79:G79)","v":0},0,0,0,0]
["Invested Amount as at Payment Date:  16 August 2019",{"$f":"SUM(C80:F80)","v":277234588.36000001},0,255634588.36000001,11250000,10350000]
{"$rows_left_out":29}
{"sheet":"Cumulative Defaults","index":1,"n_rows":8,"n_cols":4,"rows_kept":8,"cut":false,"hidden":false,"merged":[]}
["Cumulative Defaults & Losses"]
[]
["Month","Gross Losses","Recoveries","Net Losses"]
["2018-10-01",0,0,0]
["2019-01-01",0,0,{"$f":"B5-C5","v":0}]
["2019-04-01",0,0,0]
["2019-07-01",0,0,0]
["2019-10-01",{"$f":"B7+'Collateral Tables'!E9/450000000","v":5.1679500000000001E-4},{"$f":"C7+'Collateral Tables'!E23/450000000","v":0},{"$f":"B8-C8","v":5.1679500000000001E-4}]

{"sheet":"Collateral Tables","index":2,"n_rows":238,"n_cols":23,"rows_kept":238,"cut":false,"hidden":false,"merged":[]}
[null,"CNHI CAPITAL AUSTRALIA RECEIVABLES TRUST SERIES 2018-1 (TERM DEAL)"]
[null,"COLLATERAL DATA TABLES"]
[]
[null,"OUTSTANDING RECEIVABLES",null,null,"2019-10-31",null,null,null,"2019-07-31",null,null,null,"2019-04-30",null,null,null,"2018-01-31",null,null,null,"2018-10-31"]
[]
[null,"Opening Balance",null,null,{"$f":"I13","v":303784588.3599999},null,null,null,323051687.18999994,null,null,null,383251538.42000002,null,null,null,410385213.19,null,null,null,449999896.88999999]
[null,"Principal Repayments - Scheduled",null,null,{"$f":"MIN(([1]Sheet1!$B$3+[2]Sheet1!$B$3+[3]Sheet1!$B$3),'[4]18 Nov 19'!$H$23)","v":19571730.579999998},null,null,null,19267098.830000028,null,null,null,54340040.480000004,null,null,null,25925049.640000001,null,null,null,32152734.129999999]
[null,"Principal Repayments - Unscheduled",null,null,{"$f":"'[4]18 Nov 19'!$H$23-'Collateral Tables'!E7","v":452675.73999999836},null,null,null,0,null,null,null,5859810.7500000671,null,null,null,1208625.1300000101,null,null,null,7461949.5699999668]
[{"$f":"SUM(U9)","v":0},"Charge-Offs",null,null,{"$f":"'[4]18 Nov 19'!$H37","v":232557.75},null,null,null,0,null,null,null,0,null,null,null,0,null,null,null,0]
[null,"Reinstatements"]
[null,"New Receivables Purchased"]
[null,"Non Cash Change in Receivables"]
[null,"Closing Balance",null,null,{"$f":"E6-E7-E8-E9+E10+E11-E12","v":283527624.2899999},null,null,null,303784588.3599999,null,null,null,323051687.18999994,null,null,null,383251538.42000002,null,null,null,410385213.19]
[]
[null,"PORTFOLIO STATISTICS"]
[]
[null,"Summary"]
[null,"Number of contracts",null,null,{"$f":"[5]Summary!$D$4","v":3136},null,null,null,3213,null,null,null,3275,null,null,null,3359,null,null,null,3402]
[null,"Dollar value of contracts",null,null,{"$f":"[5]Summary!$G$5","v":283751171.76999974},null,null,null,303784588.36000079,null,null,null,323051687.18999928,null,null,null,383251538.41999996,null,null,null,410385213.18999952]
[null,"Number of contracts closed during the Quarter",null,null,{"$f":"[5]Summary!$B$19","v":77},null,null,null,63,null,null,null,84,null,null,null,43,null,null,null,64]
[null,"Dollar value of contracts closed during the Quarter",null,null,{"$f":"[5]Summary!$B$20","v":7503678.2700000023},null,null,null,2932187.6999999997,null,null,null,13591506.540000001,null,null,null,6683029.9000000004,null,null,null,8769089.4699999988]
[]
[{"$f":"SUM(U23)","v":0},"Dollar Value of Recoveries from Collateral",null,null,{"$f":"[5]Summary!$C$16","v":0},null,null,null,0,null,null,null,0,null,null,null,0,null,null,null,0]
[null,"Dollar Value of Recoveries from Other Sources",null,null,0,null,null,null,0,null,null,null,0,null,null,null,0,null,null,null,0]
[]
[null,"Average Term of Contracts (Months)",null,null,{"$f":"[6]Sheet1!$W$3137","v":55.229718859646013},null,null,null,54.947784815596883,null,null,null,54.732139457705259,null,null,null,54.130152888845871,null,null,null,53.786897918104366]
[null,"Average Term to Maturity (Months)",null,null,{"$f":"[6]Sheet1!$X$3137","v":31.293992521359257},null,null,null,33.97737814677452,null,null,null,36.718509707251606,null,null,null,39.110875570193862,null,null,null,41.776292365564615]
[null,"Average Residual / Balloon Payment *",null,null,{"$f":"[6]Sheet1!$AI$3137","v":4.035487075491407E-2},null,null,null,3.986054751657539E-2,null,null,null,3.9280139290494481E-2,null,null,null,3.9775154630899499E-2,null,null,null,3.9736399863039409E-2]
[null,"Average Seasoning (Months)",null,null,{"$f":"E26-E27","v":23.935726338286756},null,null,null,20.970406668822363,null,null,null,18.013629750453653,null,null,null,15.019277318652009,null,null,null,12.010605552539751]
[null,"Average Dollar Value of Individual Assets",null,null,{"$f":"E19/E18","v":90481.878753188692},null,null,null,94548.580255213441,null,null,null,98641.736546564673,null,null,null,114096.91527835664,null,null,null,120630.57412992344]
[null,"Weighted Average Interest Rate",null,null,{"$f":"[6]Sheet1!$AA$3137/100","v":2.5648800550332206E-2},null,null,null,2.5567676696328468E-2,null,null,null,2.5489074791593555E-2,null,null,null,2.5471722602341703E-2,null,null,null,2.550199740116188E-2]
[]
[null,"Payment in Arrears"]
["1. 0 - 30 Days","0 - 30 Days",null,null,{"$f":"IFERROR(VLOOKUP($A$34,'[7]Arrears Reporting'!$A$1:$D$5,3,FALSE),0)","v":3129},{"$f":"IFERROR(VLOOKUP($A$34,'[7]Arrears Reporting'!$A$1:$D$5,2,FALSE),0)","v":40536.400000000001},{"$f":"F34/F$50","v":1.4297160674029506E-4},null,3204,81213.810000000027,2.6781077738541477E-4,null,3266,362832.45,1.1231405511484118E-3,null,3354,193610.88999999998,5.051796812041092E-4,null,3400,279239.7,6.8043314189957925E-4]
["2. 31 - 60 Days","31 - 60 Days",null,null,{"$f":"IFERROR(VLOOKUP($A$35,'[7]Arrears Reporting'!$A$1:$D$5,3,FALSE),0)","v":3},{"$f":"IFERROR(VLOOKUP($A$35,'[7]Arrears Reporting'!$A$1:$D$5,2,FALSE),0)","v":182468.94},{"$f":"F35/F$50","v":6.4356670873581508E-4},null,4,139327.32999999996,4.5944600503700295E-4,null,6,249320.55,7.7176674781879377E-4,null,3,8888.9800000000032,2.3193592481444121E-5,null,1,45938.869999999995,1.1194085099438339E-4]
["3. 61 - 90 Days","61 - 90 Days",null,null,{"$f":"IFERROR(VLOOKUP($A$36,'[7]Arrears Reporting'!$A$1:$D$5,3,FALSE),0)","v":2},{"$f":"IFERROR(VLOOKUP($A$36,'[7]Arrears Reporting'!$A$1:$D$5,2,FALSE),0)","v":65496.42},2.3100542729835889E-4,null,2,58160.67,1.9179070955982198E-4,null,2,44319.770000000004,1.3719095660978185E-4,null,2,16836.879999999994,4.3931669705520386E-5,null,1,2144.1999999999953,5.2248471218851559E-6]
["4. 91 - 120 Days","91 - 120 Days",null,null,{"$f":"IFERROR(VLOOKUP($A$37,'[7]Arrears Reporting'!$A$1:$D$5,3,FALSE),0)","v":1},{"$f":"IFERROR(VLOOKUP($A$37,'[7]Arrears Reporting'!$A$1:$D$5,2,FALSE),0)","v":3097.71},1.0925602074073656E-5,null,1,3052.8799999999983,1.0067181506007222E-5,null,1,3108.0499999999993,9.6209062612696854E-6,null,0,0,0,null,0,0,0]
["5. 121 - 150 Days","121 - 150 Days",null,null,{"$f":"IFERROR(VLOOKUP($A$38,'[7]Arrears Reporting'!$A$1:$D$5,3,FALSE),0)","v":0},{"$f":"IFERROR(VLOOKUP($A$38,'[7]Arrears Reporting'!$A$1:$D$5,2,FALSE),0)","v":0},0,null,0,0,0,null,0,0,0,null,0,0,0,null,0,0,0]
["6. 151 - 180 Days","151 - 180 Days",null,null,{"$f":"IFERROR(VLOOKUP($A$39,'[7]Arrears Reporting'!$A$1:$D$5,3,FALSE),0)","v":0},{"$f":"IFERROR(VLOOKUP($A$39,'[7]Arrears Reporting'!$A$1:$D$5,2,FALSE),0)","v":0},0,null,0,0,0,null,0,0,0,null,0,0,0,null,0,0,0]
[null,"Total",null,null,{"$f":"SUM(E34:E39)","v":3135},{"$f":"SUM(F34:F39)","v":291599.47000000003},{"$f":"SUM(G34:G39)","v":1.0284693448485427E-3},null,3211,281754.69,9.2911467348824703E-4,null,3275,659580.82000000007,2.0417191618382572E-3,null,3359,219336.75,5.7230494339107374E-4,null,3402,327322.77,7.9759884001584784E-4]
[null,"* Expressed as a % of Aggreg. Rec. closing bal.",null,null,null,"> 30 days",{"$f":"SUM(G35:G39)","v":8.8549773810824755E-4},null,null,"> 30 days",6.6130389610283226E-4,null,null,"> 30 days",9.1857861068984535E-4,null,null,"> 30 days",6.7125262186964514E-5,null,null,"> 30 days",1.1716569811626855E-4]
[]
[" 0 - 30 Days","Account Balances in Arrears"]
["1. 0 - 30 Days","0 - 30 Days",null,null,{"$f":"IFERROR(VLOOKUP($A$44,'[7]Arrears Reporting'!$A$1:$D$5,3,FALSE),0)","v":3129},{"$f":"IFERROR(VLOOKUP($A$44,'[7]Arrears Reporting'!$A$1:$D$5,4,FALSE),0)","v":282723462.42000002},{"$f":"F44/F$50","v":0.99716372656098784},null,3204,302305095.69000071,0.99688172103132788,null,3266,321682443.05999917,0.99576153233586195,null,3354,382732142.23999995,0.99864476426594062,null,3400,410108423.92999953,0.99932553793093948]
["2. 31 - 60 Days","31 - 60 Days",null,null,{"$f":"IFERROR(VLOOKUP($A$45,'[7]Arrears Reporting'!$A$1:$D$5,3,FALSE),0)","v":3},{"$f":"IFERROR(VLOOKUP($A$45,'[7]Arrears Reporting'!$A$1:$D$5,4,FALSE),0)","v":439163.95},{"$f":"F45/F$50","v":1.5489282608696037E-3},null,4,615007.14999999991,2.02804846785403E-3,null,6,825480.22,2.5552574177224556E-3,null,3,196286.38,5.1216070993273489E-4,null,1,205758.3,5.0137844490205435E-4]
["3. 61 - 90 Days","61 - 90 Days",null,null,{"$f":"IFERROR(VLOOKUP($A$46,'[7]Arrears Reporting'!$A$1:$D$5,3,FALSE),0)","v":2},{"$f":"IFERROR(VLOOKUP($A$46,'[7]Arrears Reporting'!$A$1:$D$5,4,FALSE),0)","v":333572.33},1.1765073362263033E-3,null,2,297182.14999999997,9.7998828791025705E-4,null,2,508259.23,1.5733062235984332E-3,null,2,323109.8,8.4307502412660511E-4,null,1,71030.959999999992,1.7308362415853951E-4]
["4. 91 - 120 Days","91 - 120 Days",null,null,{"$f":"IFERROR(VLOOKUP($A$47,'[7]Arrears Reporting'!$A$1:$D$5,3,FALSE),0)","v":1},{"$f":"IFERROR(VLOOKUP($A$47,'[7]Arrears Reporting'!$A$1:$D$5,4,FALSE),0)","v":31425.59},{"$f":"F47/F$50","v":1.108378419164442E-4},null,1,33431.029999999984,1.1024221290806472E-4,null,1,35504.679999999986,1.0990402281699989E-4,null,0,0,0,null,0,0,0]
["5. 121 - 150 Days","121 - 150 Days",null,null,{"$f":"IFERROR(VLOOKUP($A$48,'[7]Arrears Reporting'!$A$1:$D$5,3,FALSE),0)","v":0},{"$f":"IFERROR(VLOOKUP($A$48,'[7]Arrears Reporting'!$A$1:$D$5,4,FALSE),0)","v":0},{"$f":"F48/F$50","v":0},null,0,0,0,null,0,0,0,null,0,0,0,null,0,0,0]
["6. 151 - 180 Days","151 - 180 Days",null,null,{"$f":"IFERROR(VLOOKUP($A$49,'[7]Arrears Reporting'!$A$1:$D$5,3,FALSE),0)","v":0},{"$f":"IFERROR(VLOOKUP($A$49,'[7]Arrears Reporting'!$A$1:$D$5,4,FALSE),0)","v":0},{"$f":"F49/F$50","v":0},null,0,0,0,null,0,0,0,null,0,0,0,null,0,0,0]
[null,"Total",null,null,{"$f":"SUM(E44:E49)","v":3135},{"$f":"SUM(F44:F49)","v":283527624.28999996},{"$f":"SUM(G44:G49)","v":1.0000000000000002},null,3211,303250716.02000064,1.0000000000000002,null,3275,323051687.18999922,0.99999999999999978,null,3359,383251538.41999996,1,null,3402,410385213.18999952,1]
["NSW",null,null,null,null,"> 30 days",{"$f":"SUM(G45:G49)","v":2.836273439012351E-3},null,null,"> 30 days",3.1182789686723519E-3,null,null,"> 30 days",4.2384676641378889E-3,null,null,"> 30 days",1.35523573405934E-3,null,null,"> 30 days",6.7446206906059385E-4]
[null,null,null,null,null,">90 days",{"$f":"SUM(G47:G49)","v":1.108378419164442E-4},null,null,">90 days",1.1024221290806472E-4,null,null,">90 days",1.0990402281699989E-4,null,null,">90 days",0,null,null,">90 days",0]
[]
["VIC","Geographic Distribution"]
["NSW","New South Wales",null,null,{"$f":"F55/F$63","v":0.28087696346845448},{"$f":"IFERROR(VLOOKUP($A$55,'[7]Geographic '!$A$1:$C$9,3,FALSE),0)","v":79636378.170000002},null,null,0.2807897352874128,85299594.150000051,null,null,0.28614818561721905,92440654.149999857,null,null,0.28738603144052582,110141138.66999999,null,null,0.28736145911134803,117928893.66000003]
["VIC","Victoria",null,null,{"$f":"F56/F$63","v":0.20669356898380692},{"$f":"IFERROR(VLOOKUP($A$56,'[7]Geographic '!$A$1:$C$9,3,FALSE),0)","v":58603336.57},null,null,0.20903558140595066,63501788.049999982,null,null,0.21114312852940728,68210143.910000011,null,null,0.20800308285426566,79717501.500000015,null,null,0.2030790640631952,83340645.00000003]
["QLD","Queensland",null,null,0.11832816045354662,{"$f":"IFERROR(VLOOKUP($A$57,'[7]Geographic '!$A$1:$C$9,3,FALSE),0)","v":33549302.219999999},null,null,0.1251462276122689,38017495.239999965,null,null,0.12751357715637754,41193476.23999998,null,null,0.12170686868550314,46644344.659999989,null,null,0.12788745367319404,52483119.93999999]
["SA","South Australia",null,null,0.18687299660017198,{"$f":"IFERROR(VLOOKUP($A$58,'[7]Geographic '!$A$1:$C$9,3,FALSE),0)","v":52983656.770000003},null,null,0.18293153477603216,55571780.98999995,null,null,0.17938524582265014,57950706.319999993,null,null,0.18110694805335675,69409516.459999979,null,null,0.17726510863908634,72746979.399999961]
["NT","Northern Territory",null,null,0,{"$f":"IFERROR(VLOOKUP($A$59,'[7]Geographic '!$A$1:$C$9,3,FALSE),0)","v":0},null,null,0,0,null,null,0,0,null,null,0,0,null,null,0,0]
["ACT","Australian Capital Territory",null,null,1.4563004258719882E-4,{"$f":"IFERROR(VLOOKUP($A$60,'[7]Geographic '!$A$1:$C$9,3,FALSE),0)","v":41290.14},null,null,1.5535857251609787E-4,47195.539999999994,null,null,1.6432549992775051E-4,53085.63,null,null,1.5384269621740196E-4,58960.45,null,null,1.5794933130300096E-4,64820.069999999992]
["TAS","Tasmania",null,null,8.539937320264139E-3,{"$f":"IFERROR(VLOOKUP($A$61,'[7]Geographic '!$A$1:$C$9,3,FALSE),0)","v":2421308.14},null,null,8.8134543113397093E-3,2677391.5900000003,null,null,9.2782870632002797E-3,2997366.2899999991,null,null,8.4380108774828634E-3,3233880.6500000004,null,null,8.4309414150312498E-3,3459933.69]
["WA","Western Australia",null,null,0.19854274313116882,{"$f":"IFERROR(VLOOKUP($A$62,'[7]Geographic '!$A$1:$C$9,3,FALSE),0)","v":56292352.280000001},null,null,0.19312810803447966,58669342.800000004,null,null,0.18636725031121798,60206254.649999984,null,null,0.19320521539264851,74046196.029999986,null,null,0.19581802376684221,80360821.430000022]
[null,"Total",null,null,{"$f":"SUM(E55:E62)","v":1},{"$f":"SUM(F55:F62)","v":283527624.28999996},null,null,1,303784588.35999995,null,null,1,323051687.18999982,null,null,1.0000000000000002,383251538.4199999,null,null,1,410385213.19]
["AG",null,null,null,null,null,{"$f":"E13-F63","v":0},null,null,null,0,null,null,null,0,null,null,null,0,null,null,null,0]
["CE","Top Industry Distribution"]
["AGRICULTURAL MACHINERY","Agricultural",null,null,{"$f":"F66/F$69","v":0.92958741794563071},{"$f":"IFERROR(VLOOKUP($A$66,'[7]Top Industry'!$A$1:$C$4,3,FALSE),)","v":263563712.18000001},null,null,0.92589605548612453,281272952.08000058,null,null,0.92260749972404432,298049909.40000004,null,null,0.92874675511393878,355943622.69999987,null,null,0.92796491411031079,380823079.10999954]
["CONSTRUCTION EQUIPMENT","Construction",null,null,{"$f":"F67/F$69","v":7.0412582054369233E-2},{"$f":"IFERROR(VLOOKUP($A$67,'[7]Top Industry'!$A$1:$C$4,3,FALSE),)","v":19963912.109999999},null,null,7.4103944513875503E-2,22511636.27999999,null,null,7.739250027595565E-2,25001777.790000018,null,null,7.1253244886061357E-2,27307915.719999999,null,null,7.2035085889689154E-2,29562134.080000013]
["MOTOR VEHICLE - AG","Motor Vehicle AG",null,null,{"$f":"F68/F$69","v":0},{"$f":"IFERROR(VLOOKUP($A$68,'[7]Top Industry'!$A$1:$C$4,3,FALSE),)","v":0},null,null,0,0,null,null,0,0,null,null,0,0,null,null,0,0]
[null,"Total",null,null,{"$f":"SUM(E66:E68)","v":1},{"$f":"SUM(F66:F68)","v":283527624.29000002},{"$f":"F63-F69","v":0},null,1,303784588.36000055,-5.9604644775390625E-7,null,1,323051687.19000006,0,null,1.0000000000000002,383251538.41999984,0,null,1,410385213.18999958,0]
["COMBINE"]
["40-100 HP TRACTOR","Collateral Types"]
["100<140 HP TRACTOR","100<140 HP TRACTOR",null,null,{"$f":"IFERROR(F72/F$104,0)","v":9.9811552263615252E-2},{"$f":"IFERROR(VLOOKUP($A$72,[7]Collateral!$A$1:$C$34,3,FALSE),\"\")","v":28299332.289999999},null,null,0.10242532262080024,31115234.469999999,null,null,0.10698751939862909,34562498.649999969,null,null,0.1007218431245978,38601801.330000013,null,null,0.10051494735728245,41249848.099999994]
["4 EWD TRACTORS","4 EWD TRACTORS",null,null,9.956720534971758E-2,{"$f":"IFERROR(VLOOKUP($A$73,[7]Collateral!$A$1:$C$34,3,FALSE),\"\")","v":28230053.190000001},null,null,9.6995431332025456E-2,29465717.18,null,null,9.5233741317393636E-2,30765420.810000014,null,null,9.8382964059179165E-2,37705422.329999991,null,null,0.10508305251737765,43124530.910000004]
["40<60 HP TRACTOR","40<60 HP TRACTOR",null,null,1.2405556879362093E-2,{"$f":"IFERROR(VLOOKUP($A$74,[7]Collateral!$A$1:$C$34,3,FALSE),\"\")","v":3517318.07},null,null,1.3061447822026701E-2,3967866.55,null,null,1.3841218564415564E-2,4471429.0099999961,null,null,1.2975684091188728E-2,4972950.8900000006,null,null,1.318187026757088E-2,5409644.6399999997]
["4WD Vehicle","4WD Vehicle",null,null,4.2112184764710858E-3,{"$f":"IFERROR(VLOOKUP($A$75,[7]Collateral!$A$1:$C$34,3,FALSE),\"\")","v":1193996.77},null,null,4.0128796084788979E-3,1219050.98,null,null,4.1713415017933199E-3,1347558.91,null,null,3.9917368011279063E-3,1529839.27,null,null,3.7864806529483031E-3,1553915.6700000002]
["60<100 HP TRACTOR","60<100 HP TRACTOR",null,null,4.4231715133241492E-2,{"$f":"IFERROR(VLOOKUP($A$76,[7]Collateral!$A$1:$C$34,3,FALSE),\"\")","v":12540913.109999999},null,null,4.5921902639340317E-2,13950366.289999997,null,null,4.8387677358906166E-2,15631720.809999993,null,null,4.6421141121430046E-2,17790973.749999993,null,null,4.6930562093822771E-2,19259608.729999997]
["BACKHOE","BACKHOE",null,null,8.1743198949441606E-4,{"$f":"IFERROR(VLOOKUP($A$77,[7]Collateral!$A$1:$C$34,3,FALSE),\"\")","v":231764.55},null,null,8.4851766638843968E-4,257766.58999999997,null,null,8.3845350679346209E-4,270863.81999999995,null,null,7.4072842908954988E-4,283885.30999999994,null,null,7.2330018348534613E-4,296831.69999999995]
["BALERS, WINDROWERS, MOWERS, RAKES","BALERS, WINDROWERS, MOWERS, RAKES",null,null,2.3693990547914805E-2,{"$f":"IFERROR(VLOOKUP($A$78,[7]Collateral!$A$1:$C$34,3,FALSE),\"\")","v":6717900.8499999996},null,null,2.4826714550319397E-2,7541973.2600000007,null,null,2.5074670961974636E-2,8100414.7600000035,null,null,2.4731878491802983E-2,9478530.4800000042,null,null,2.5012008206172172E-2,10264558.319999998]
["COMBINES","COMBINES",null,null,0.32991066730882607,{"$f":"IFERROR(VLOOKUP($A$79,[7]Collateral!$A$1:$C$34,3,FALSE),\"\")","v":93538787.730000004},null,null,0.32641744449685411,99160589.009999976,null,null,0.3152474638837065,101841225.08999994,null,null,0.33365369818780866,127873293.13000005,null,null,0.32706074703977811,134220894.40000004]
["COMPACT TRACK LOADER","COMPACT TRACK LOADER",null,null,1.2799563919345393E-2,{"$f":"IFERROR(VLOOKUP($A$80,[7]Collateral!$A$1:$C$34,3,FALSE),\"\")","v":3629029.95},null,null,1.3703811876942968E-2,4163006.8499999987,null,null,1.4331192665392501E-2,4629715.9699999988,null,null,1.3198669053890551E-2,5058410.2200000007,null,null,1.3428185014669721E-2,5510728.5699999984]
{"$rows_left_out":158}